�s���{���R�[�h���͎s�撬���R�[�h,NO,�s���{����,�s�撬����,����,����_�J�i,��Ë@�ւ̎��,�Z��,����,�ܓx,�o�x,�d�b�ԍ�,�����ԍ�,FAX�ԍ�,�@�l�ԍ�,�@�l�̖���,��Ë@�փR�[�h,�f�×j��,�f�ÊJ�n����,�f�ÏI������,�f�Ó������L����,���ԊO�ɂ�����Ή�,�f�ÉȖ�,�a����,URL,���l
102083,101,�Q�n��,�a��s,�Ɨ��s���@�l�����a�@�@�\�a���ÃZ���^�[,,�a�@,�Q�n���a��s����38,,,,0279-23-3030,,0279-23-2740,,,,,,,,,���ȁA�ċz����ȁA�z����ȁA��������ȁA�]�_�o���ȁA���t���ȁA������E��ӓ��ȁA�O�ȁA�ċz��O�ȁA������O�ȁA���B�E������O�ȁA���`�O�ȁA�]�_�o�O�ȁA���_�ȁA�����ȁA�畆�ȁA��A��ȁA�w�l�ȁA��ȁA���@��A�ȁA���n�r���e�[�V�����ȁA���ː��f�f�ȁA���ː����ÉȁA�����ȁA�Տ�������,,,
102083,102,�Q�n��,�a��s,�Y���a�@,,�a�@,�Q�n���a��s�a��3658-20,,,,0279-22-1970,,0279-25-1132,,,,,,,,,���_�ȁA���ȁA���ȁA���Ȍ��o�O��,,,
102083,103,�Q�n��,�a��s,��Ö@�l�P�a��  �֌��a�@,,�a�@,�Q�n���a��s�a��1693-12,,,,0279-22-2378,,0279-23-1365,,,,,,,,,���`�O�ȁA���ȁA���n�r���e�[�V�����ȁA�]�_�o�O�ȁA�O�ȁA���E�}�`�ȁA�`���O�� ,,,
102083,104,�Q�n��,�a��s,�k�ѕی����������g���k�ѕa�@,,�a�@,�Q�n���a��s�L�n237-1,,,,0279-24-1234,,0279-24-3834,,,,,,,,,���ȁA�A��������ȁA�_�o���ȁA�畆�ȁA�����ȁA���_�ȁA�O�ȁA������O�ȁA���O�ȁA��ȁA�~�}��,,,
102083,105,�Q�n��,�a��s,�a�쒆���a�@,,�a�@,�Q�n���a��s�Ό����c��508-1,,,,0279-25-1711,,0279-25-1712,,,,,,,,,���ȁA�ċz����ȁA�z����ȁA��������ȁA�t�����ȁA���A�a���ȁA���t���ȁA���E�}�`�ȁA�����ȁA�O�ȁA������O�ȁA��A��ȁA�Y�w�l�ȁA���n�r����,,,
102083,106,�Q�n��,�a��s,�Q�n����������ÃZ���^�[,,�a�@,�Q�n���a��s�k�k�������c779,,,,0279-52-3551,,0279-52-2045,,,,,,,,,�����ȁA�����O�ȁA�����ȁA���ː��ȁA�z��ȁA�A�����M�[�ȁA�_�o���ȁA�`���O�ȁA�S�����ǊO�ȁA�Y�ȁA���n�r���e�[�V�����ȁA���@��A�ȁA���_�ȁA��ȁA���`�O�ȁA����,,,
102083,107,�Q�n��,�a��s,��Ö@�l�k��  ��V���a�@,,�a�@,�Q�n���a��s�k�k����쎺167-5,,,,0279-52-2221,,0279-52-2205,,,,,,,,,���ȁA���_�ȁA�S�Ó���,,,
102083,108,�Q�n��,�a��s,�k�֓��z��a�@,,�a�@,�Q�n���a��s�k�k�������c740,,,,0272-32-7111,,027-233-9092,,,,,,,,,���ȁA�O�ȁA�S�����ǊO�ȁA�z��ȁA���t���͓��ȁA�w�l�ȁA��ȁA���`�O�ȁA�畆�ȁA��A��ȁA���n�r���e�[�V�����ȁA���ː���,,,
102083,109,�Q�n��,�a��s,�ԏ鍂���z�X�s�^��,,�a�@,�Q�n���a��s�ԏ钬�k�ԏ�R1051,,,,0279-56-8148,,0279-56-8847,,,,,,,,,���_�ȁA�_�o��,,,
103454,110,�Q�n��,�g����,�Q�h��@�c���a�@,,�a�@,�Q�n���g�����w��98,,,,0279-54-2106,,0279-54-0247,,,,,,,,,���_�ȁA���ȁA���ȁA�S�Ó���,,,
102083,201,�Q�n��,�a��s,���{�J�[���b�g�i���j�Q�n�H��f�Ï�,,�f�Ï�,�Q�n���a��s���c2470,,,,0279-23-8811,,0279-23-8834,,,,,,,,,��,,,
102083,202,�Q�n��,�a��s,�{��V�l�z�[���t�����f�Ï�,,�f�Ï�,�Q�n���a��s����2399-7,,,,0279-53-2506,,0279-53-3877,,,,,,,,,��,,,
102083,203,�Q�n��,�a��s,�a��ی���,,�f�Ï�,�Q�n���a��s����394,,,,0279-22-4166,,,,,,,,,,,��,,,
102083,204,�Q�n��,�a��s,�Љ���@�l�O�����f�Ï�,,�f�Ï�,�Q�n���a��s�a��3668-4,,,,0279-22-1027,,0279-22-1441,,,,,,,,,���A��,,,
102083,205,�Q�n��,�a��s,�R�I�m��@,,�f�Ï�,�Q�n���a��s�a��2104-30,,,,0279-22-0171,,0279-22-0774,,,,,,,,,���A�O�A�����A��A��,,,
102083,206,�Q�n��,�a��s,����O�Ȉݒ��Ȉ�@,,�f�Ï�,�Q�n���a��s�a��2217,,,,0279-24-2454,,0279-24-3074,,,,,,,,,�O�A���A�����A��A��O,,,
102083,207,�Q�n��,�a��s,�Љ���@�l������g�̏�Q�җÌ�{�ݐ������f�Ï��@,,�f�Ï�,�Q�n���a��s�a��2908-1,,,,0279-25-1055,,0279-22-4880,,,,,,,,,��,,,
102083,208,�Q�n��,�a��s,�a��畆�Ȉ�@,,�f�Ï�,�Q�n���a��s�a��1778-9,,,,0279-25-1166,,0279-25-1343,,,,,,,,,��,,,
102083,209,�Q�n��,�a��s,�g�̏�Q�җÌ�{�݂����ڂ̃z�[���f�Î�,,�f�Ï�,�Q�n���a��s�a��3645-17,,,,0279-22-1731,,0279-23-8147,,,,,,,,,��,,,
102083,210,�Q�n��,�a��s,�k�ѕی����������g���k�ѐf�Ï�,,�f�Ï�,�Q�n���a��s�a��908-22,,,,0279-24-2818,,0279-25-0843,,,,,,,,,��,,,
102083,211,�Q�n��,�a��s,��Ö@�l�Вc�c����@�c����@�@,,�f�Ï�,�Q�n���a��s�a��1829-21,,,,0279-22-0210,,0279-24-2177,,,,,,,,,���A�O�A���A�݁A��A����,,,
102083,212,�Q�n��,�a��s,���ʗ{��V�l�z�[���i�����f�Î�,,�f�Ï�,�Q�n���a��s���c785-5,,,,0279-23-1122,,0279-25-1170,,,,,,,,,���A��,,,
102083,213,�Q�n��,�a��s,�����@,,�f�Ï�,�Q�n���a��s����1284-6,,,,0279-25-1100,,0279-25-1101,,,,,,,,,���A���A�����A��A��A��,,,
102083,214,�Q�n��,�a��s,������@,,�f�Ï�,�Q�n���a��s�k�k��1372,,,,0279-52-3003,,0279-52-3851,,,,,,,,,���A�O�A�����A���n,,,
102083,215,�Q�n��,�a��s,��Ö@�l�X��@,,�f�Ï�,�Q�n���a��s�Ό�208-4,,,,0279-23-8733,,0279-23-8752,,,,,,,,,���A�C�A���A�ݓ��A�̓��A����,,,
102083,216,�Q�n��,�a��s,�a��n��L�挗��ԋ}���f�Ï�,,�f�Ï�,�Q�n���a��s�a��1760-1,,,,0279-23-8899,,,,,,,,,,,���A�����A�O,,,
102083,217,�Q�n��,�a��s,��Ö@�l�����ޗǓ��Ȉ�@,,�f�Ï�,�Q�n���a��s�a��2078-21,,,,0279-25-1155,,0279-25-1156,,,,,,,,,�एz������,,,
102083,218,�Q�n��,�a��s,��Ö@�l������Ζk��@,,�f�Ï�,�Q�n���a��s�a��1592,,,,0279-22-1378,,0279-22-1309,,,,,,,,,"������ऊO���,�礔夃��n����A�A���A�z",,,
102083,219,�Q�n��,�a��s,�{���@,,�f�Ï�,�Q�n���a��s�Ό�208-1,,,,0279-23-6411,,0279-22-4470,,,,,,,,,�����A�A��,,,
102083,220,�Q�n��,�a��s,�L�n�N���j�b�N,,�f�Ï�,�Q�n���a��s�L�n1191-3,,,,0279-24-8818,,0279-24-8897,,,,,,,,,��A�O�A���A����,,,
102083,221,�Q�n��,�a��s,�쓇��@,,�f�Ï�,�Q�n���a��s�a��1770,,,,0279-22-2421,,0279-22-0010,,,,,,,,,���A���A����,,,
102083,222,�Q�n��,�a��s,�쓇���ȃN���j�b�N,,�f�Ï�,�Q�n���a��s�a��1770,,,,0279-23-2001,,020-4666-7430,,,,,,,,,���A�����A�āA���A�z�A�A���A��,,,
102083,223,�Q�n��,�a��s,�m�I��Q�ҍX���{�݂߂��݂̗��f�Ï�,,�f�Ï�,�Q�n���a��s�a��3644-1,,,,0279-23-6601,,0279-23-8147,,,,,,,,,��,,,
102083,224,�Q�n��,�a��s,�Љ���@�l�k������ʗ{��V�lΰт˂ނ̋u�㖱��,,�f�Ï�,�Q�n���a��s�k�k������2365-1,,,,0279-20-4000,,0279-20-4001,,,,,,,,,���A��,,,
102083,225,�Q�n��,�a��s,�����Ȉ�@�@�@�@�@�@,,�f�Ï�,�Q�n���a��s�L�n618�9�@�@�@�@�@,,,,0279-20-1188,,0279-20-1189,,,,,,,,,��@�@�@�@,,,
102083,226,�Q�n��,�a��s,������@�@�@�@�@�@,,�f�Ï�,�Q�n���a��s�Ό�210�8�@�@�@�@�@,,,,0279-22-1060,,0279-22-1060,,,,,,,,,���A��A��@,,,
102083,227,�Q�n��,�a��s,�_�R���Ȉ�@,,�f�Ï�,�Q�n���a��s�a��892-23,,,,0279-22-2181,,0279-23-5957,,,,,,,,,���A�z�A�āA�S���A�������,,,
102083,228,�Q�n��,�a��s,��J���ȃN���j�b�N�@,,�f�Ï�,�Q�n���a��s����180�@�@,,,,0279-20-1881,,0279-20-1882,,,,,,,,,"���A������,����",,,
102083,229,�Q�n��,�a��s,��Ö@�l�Вc�I���N���j�b�N �I�K��,,�f�Ï�,�Q�n���a��s�Ό�113-7,,,,0279-22-1377,,0279-22-1385,,,,,,,,,�Y�A�w,,,
102083,230,�Q�n��,�a��s,�ԏ�J���N���j�b�N�@�@�@�@�@�@�@,,�f�Ï�,�Q�n���a��s�ԏ钬�O���c826-10�@�@�@�@�@�@,,,,0279-20-6500,,0279-20-6500,,,,,,,,,���A�ē��A�����A�z���A���A�a���ȁ@�@�@�@,,,
102083,231,�Q�n��,�a��s,�������`�O�Ȉ�@�@�@�@�@�@�@�@,,�f�Ï�,�Q�n���a��s�s�K�c35-7�@�@�@�@�@�@,,,,0279-20-1007,,0279-20-1067,,,,,,,,,���A��A���E�A���n�@�@�@�@,,,
102083,232,�Q�n��,�a��s,�Љ���@�l������Ȃ����f�Ï��@�@�@�@,,�f�Ï�,�Q�n���a��s����2212-1�@�@�@�@�@�@,,,,0279-24-8383,,0279-25-0485,,,,,,,,,���@�@�@�@,,,
102083,233,�Q�n��,�a��s,���`���Ȏ��Ȉ�@,,�f�Ï�,�Q�n���a��s�Ό�564-2,,,,0279-22-2233,,,,,,,,,,,���A��,,,
102083,234,�Q�n��,�a��s,�߂��݂��ǂ��N���j�b�N�@�@�@�@�@�@�@,,�f�Ï�,�Q�n���a��s�s�K�c28-5�@�@�@�@�@�@,,,,0279-30-2022,,0279-30-2021,,,,,,,,,�����A�A���A���@�@�@,,,
102083,235,�Q�n��,�a��s,���������Ȉ�@�@�@�@�@�@�@�@,,�f�Ï�,�Q�n���a��s���c545-2�@�@�@�@�@�@,,,,0279-60-7322,,0279-60-7322,,,,,,,,,���@�@�@�@,,,
102083,236,�Q�n��,�a��s,�����@,,�f�Ï�,�Q�n���a��s�a��893-33,,,,0279-22-1219,,0279-22-1634,,,,,,,,,���A�����A���n�A�z��A�S��,,,
102083,237,�Q�n��,�a��s,�����̊�ȁ@�@�@�@�@�@�@,,�f�Ï�,�Q�n���a��s�a��2077-26,,,,0279-60-6677,,,,,,,,,,,��,,,
102083,238,�Q�n��,�a��s,�ˉz�N���j�b�N,,�f�Ï�,�Q�n���a��s�a��3902-5,,,,0279-60-7700,,0279-60-7701,,,,,,,,,���A�ċz��A�A���A��,,,
102083,239,�Q�n��,�a��s,��Ö@�l�Вc�ق�����������N���j�b�N,,�f�Ï�,�Q�n���a��s���c1048,,,,0279-25-1384,,0279-22-1928,,,,,,,,,��,,,
102083,240,�Q�n��,�a��s,������ȃN���j�b�N,,�f�Ï�,�Q�n���a��s�a��1824-21,,,,0279-20-1311,,0279-24-5151,,,,,,,,,���A���A�A���A����,,,
102083,241,�Q�n��,�a��s,�݂䂫�����Ȉ�@,,�f�Ï�,�Q�n���a��s�s�K�c342-9,,,,0279-60-6070,,0279-60-6071,,,,,,,,,���A�_���A�]�_�o��,,,
102083,242,�Q�n��,�a��s,���ʗ{��V�l�z�[���Ђ���̗��㖱��,,�f�Ï�,�Q�n���a��s�a��2216-1,,,,0279-23-6699,,0279-24-9693,,,,,,,,,���A�O�A��,,,
102083,243,�Q�n��,�a��s,�Ƃ܂�N���j�b�N,,�f�Ï�,�Q�n���a��s����599-1,,,,0279-26-7711,,0279-26-7712,,,,,,,,,��A��A���A�O�A�A���A���n,,,
102083,244,�Q�n��,�a��s,�ɍ��ۃN���j�b�N,,�f�Ï�,�Q�n���a��s�ɍ��ے��ɍ��ێ��ԓy99-4,,,,0279-72-4114,,0279-72-5337,,,,,,,,,���A���e�畆,,,
102083,245,�Q�n��,�a��s,�a��s���ʗ{��V�l�z�[���u�����̋��v�f�Ï�,,�f�Ï�,�Q�n���a��s�ԏ钬�~��44-1,,,,0279-56-9201,,0279-56-9277,,,,,,,,,��,,,
102083,246,�Q�n��,�a��s,�a��s�������N�ی��������f�Ï�,,�f�Ï�,�Q�n���a��s�ԏ钬�~��44-7,,,,0279-56-2220,,0279-56-4130,,,,,,,,,���A�O�A����,,,
102083,247,�Q�n��,�a��s,�����@,,�f�Ï�,�Q�n���a��s�ɍ��ے��ɍ���539-7,,,,0279-72-2503,,0279-72-3936,,,,,,,,,���A���A�A���A����,,,
102083,248,�Q�n��,�a��s,���̂������@��A�Ȉ�@,,�f�Ï�,�Q�n���a��s�L�n140-4,,,,0279-30-1133,,0279-30-1135,,,,,,,,,���@��A��,,,
102083,249,�Q�n��,�a��s,�֓����ȊO�ȃN���j�b�N,,�f�Ï�,�Q�n���a��s����934-2,,,,0279-22-1678,,0279-22-1861,,,,,,,,,���A�O�A���A�āA�z�A���O�A��A��A��O,,,
102083,250,�Q�n��,�a��s,��S�����`��@���,,�f�Ï�,�Q�n���a��s�Ό�966,,,,0279-22-0073,,0279-24-6867,,,,,,,,,��,,,
102083,251,�Q�n��,�a��s,���������`�O��,,�f�Ï�,�Q�n���a��s���䎚�c��770-1,,,,0279-30-1170,,0279-30-1171,,,,,,,,,���O�A���n�A���E,,,
102083,252,�Q�n��,�a��s,�ӂ�܂����Ȉ�@,,�f�Ï�,�Q�n���a��s���،�1129-1,,,,0279-25-8881,,0279-25-8882,,,,,,,,,���A�z�A��,,,
102083,253,�Q�n��,�a��s,��Ö@�l�Έ��a��ɍ��ە��@,,�f�Ï�,�Q�n���a��s����116-1,,,,0279-30-3111,,0279-30-3118,,,,,,,,,���A��A�`���A���n�@�@�@,,,
102083,254,�Q�n��,�a��s,���ʗ{��V�l�z�[������q�q���Y�㖱��,,�f�Ï�,�Q�n���a��s����q3615-1,,,,0279-26-2626,,,,,,,,,,,��,,,
102083,255,�Q�n��,�a��s,�����J���ȑ�񋤍ϑg���a���ÃZ���^�[������,,�f�Ï�,�Q�n���a��s����383,,,,0279-23-3030,,,,,,,,,,,��,,,
102083,256,�Q�n��,�a��s,���ʗ{��V�l�z�[���J�i���f�Ï�,,�f�Ï�,�Q�n���a��s�a��3653-1,,,,0279-26-2511,,0279-23-8147,,,,,,,,,��,,,
102083,257,�Q�n��,�a��s,�����݈�@,,�f�Ï�,�Q�n���a��s�a��2194�2,,,,0279-25-1388,,0279-25-1388,,,,,,,,,���A�S��,,,
103446,258,�Q�n��,�Y����,�Y�����q�w���㖱�ېf�Ï�,,�f�Ï�,�Q�n���Y�����V��1027-1,,,,0279-54-3232,,,,,,,,,,,���A�Y�w,,,
103446,259,�Q�n��,�Y����,�e�n��@,,�f�Ï�,�Q�n���Y�����R�q�c884,,,,0279-54-3346,,0279-54-3878,,,,,,,,,���A����,,,
103446,260,�Q�n��,�Y����,���㎩�q�����n�����Ԓn�㖱��,,�f�Ï�,�Q�n���Y�����厚�V��1017-2,,,,0279-54-2011,,,,,,,,,,,���A���A�O�A��,,,
103446,261,�Q�n��,�Y����,�Y�������Ƃ���@,,�f�Ï�,�Q�n���Y�����V��1182-2,,,,0279-54-1055,,0279-54-1056,,,,,,,,,�āA���A�z�A���A�����A�A���A��,,,
103446,262,�Q�n��,�Y����,���ʗ{��V�l�z�[������Ƃ����㖱��,,�f�Ï�,�Q�n���Y�����L�n��1797-1,,,,0279-55-6622,,,,,,,,,,,���A���_,,,
103446,263,�Q�n��,�Y����,�Y���킩�΃N���j�b�N,,�f�Ï�,�Q�n���Y�����R�q�c1369-1,,,,0279-20-5531,,0279-20-5532,,,,,,,,,���A�z�A���A���n,,,
103454,264,�Q�n��,�g����,��Ö@�l�Вc������@,,�f�Ï�,�Q�n���g��������c811,,,,0279-54-2756,,0279-54-0980,,,,,,,,,���A�C�A���A����,,,
103454,265,�Q�n��,�g����,���ʗ{��V�l�z�[���D�����㖱��,,�f�Ï�,�Q�n���g�������c2135,,,,0279-54-2700,,,,,,,,,,,���A��,,,
103454,266,�Q�n��,�g����,�֌���@,,�f�Ï�,�Q�n���g��������c686-1,,,,0279-55-5122,,0279-55-5125,,,,,,,,,���A�݁A�O,,,
103454,267,�Q�n��,�g����,��񂱂ǂ��f�Ï��@�@�@,,�f�Ï�,�Q�n���g������v��2276�@�@�@�@�@,,,,0279-55-5252,,0279-55-5151,,,,,,,,,�����A���@�@�@,,,
103454,268,�Q�n��,�g����,�ɂ݂̃N���j�b�N���J���@�@�@�@�@�@�@�@,,�f�Ï�,�Q�n���g������v��1406-4�@�@�@�@�@�@,,,,0279-30-5055,,0279-30-5060,,,,,,,,,���A������n�A���@�@�@�@,,,
103454,269,�Q�n��,�g����,��쐮�`�O�ȃ��n�r�����ȁ@�@�@�@�@�@�@,,�f�Ï�,�Q�n���g�����쉺917-2�@�@�@�@�@�@,,,,0279-30-5255,,0279-55-5657,,,,,,,,,���A������n�@�@�@�@,,,
103454,270,�Q�n��,�g����,�|�������ȁ@�@�@�@�@�@�@,,�f�Ï�,�Q�n���g������v��3347-10�@�@�@�@�@�@,,,,0279-30-5151,,0279-30-5150,,,,,,,,,�����@�@�@�@,,,
103454,271,�Q�n��,�g����,���{���ȃN���j�b�N,,�f�Ï�,�Q�n���g������v��3457�@�@�@�@�@�@,,,,0279-20-5353,,0279-20-5354,,,,,,,,,���A�z��,,,
103454,272,�Q�n��,�g����,�����ȃN���j�b�N,,�f�Ï�,�Q�n���g�����k��1126-1,,,,0279-30-5575,,0279-30-5576,,,,,,,,,���A�ċz��A�A�������,,,
103454,273,�Q�n��,�g����,���Ȃߊ�ȃN���j�b�N,,�f�Ï�,�Q�n���g������v��2243-3,,,,0279-20-5113,,0279-20-5118,,,,,,,,,��,,,
103454,274,�Q�n��,�g����,���N���j�b�N,,�f�Ï�,�Q�n���g������v��795-3,,,,0279-30-5800,,0279-30-5803,,,,,,,,,�z�A�S�O�A�āA���A�O,,,
103454,275,�Q�n��,�g����,�܂������N���j�b�N,,�f�Ï�,�Q�n���g������v��751-4,,,,0279-30-6510,,0279-30-6511,,,,,,,,,�Y�w�A���A�����A�A���A�S��,,,
103454,276,�Q�n��,�g����,����΂琮�`�O��,,�f�Ï�,�Q�n���g��������1179,,,,0279-25-8855,,,,,,,,,,,���A���E�A���n�@�@�@�@,,,
103454,277,�Q�n��,�g����,�����畆��,,�f�Ï�,�Q�n���g��������c695-10,,,,0279-26-3212,,0279-26-3213,,,,,,,,,�畆,,,
103454,278,�Q�n��,�g����,�g�����悾���@��A��,,�f�Ï�,�Q�n���g������v��2176-1,,,,0279-26-7546,,,,,,,,,,,��,,,
